Target
Alpha-1A/Alpha-1B/Alpha-1D adrenergic receptor
Ligand
BDBM50052882
Substrate
Meas. Tech.
ChEMBL_33250 (CHEMBL643530)
Ki
470±n/a nM
Citation
  Analogs of UK 14,304: Structural features responsible for ?A2 adrenoceptor activity Bioorg Med Chem Lett 5:1745-1750 (1995)   
Target
Name:
Alpha-1A/Alpha-1B/Alpha-1D adrenergic receptor
Synonyms:
Adrenergic receptor alpha-1
Type:
Mol. Mass.:
Description:
ASSAY_ID of ChEMBL is 306566
Components:
This complex has 3 components.
Component 1
Name:
Alpha-1D adrenergic receptor
Synonyms:
ADA1D_HUMAN ADRA1D Adrenergic receptor alpha Alpha 1D-adrenoreceptor Alpha-1D adrenoceptor adrenergic Alpha1D
Type:
Enzyme Catalytic Domain
Mol. Mass.:
60485.82
Organism:
Homo sapiens (Human)
Description:
adrenergic Alpha1D ADRA1D HUMAN::P25100
Residue:
572
  
Component 2
Name:
Alpha-1B adrenergic receptor
Synonyms:
ADA1B_HUMAN Adrenergic alpha1B Adrenergic receptor alpha Alpha 1B-adrenoreceptor | Alpha-1B adrenergic receptor
Type:
Enzyme
Mol. Mass.:
56862.13
Organism:
Homo sapiens (Human)
Description:
P35368
Residue:
520
  
Component 3
Name:
Alpha-1A adrenergic receptor
Synonyms:
ADA1A_HUMAN ADRA1C Alpha 1A-adrenoceptor Alpha adrenergic receptor 1a Alpha-adrenergic receptor 1c adrenergic Alpha1 | adrenergic Alpha1C
Type:
Cell-surface receptors
Mol. Mass.:
51511.67
Organism:
Homo sapiens (Human)
Description:
P35348
Residue:
466
  
Inhibitor
Name:
BDBM50052882
Synonyms:
AGN-193080 Imidazolidin-2-ylidene-(5-methyl-3,4-dihydro-2H-benzo[1,4]oxazin-6-yl)-amine
Type:
Small organic molecule
Emp. Form.:
C12H16N4O
Mol. Mass.:
232.2816
SMILES:
[#6]-c1c(ccc2-[#8]-[#6]-[#6]-[#7]-c12)\[#7]=[#6]-1/[#7]-[#6]-[#6]-[#7]-1
: