Target
DNA topoisomerase 2-alpha/2-beta
Ligand
BDBM50127140
Substrate
Meas. Tech.
ChEMBL_208606 (CHEMBL812283)
EC50
810±n/a nM
Citation
  TBA Bioorg Med Chem Lett 5:1021-1026 (1995)   
Target
Name:
DNA topoisomerase 2-alpha/2-beta
Synonyms:
DNA topoisomerase II
Type:
Mol. Mass.:
Description:
ASSAY_ID of ChEMBL is 1821483
Components:
This complex has 2 components.
Component 1
Name:
DNA topoisomerase 2-alpha
Synonyms:
DNA topoisomerase 2-alpha DNA topoisomerase II (Topo II) DNA topoisomerase II, alpha isozyme TOP2A Topoisomerase I/II | Topoisomerase II alpha (HuTopoIIα)
Type:
Protein
Mol. Mass.:
174415.30
Organism:
Homo sapiens (Human)
Description:
P11388
Residue:
1531
  
Component 2
Name:
DNA topoisomerase 2-beta
Synonyms:
DNA topoisomerase II TOP2B | TOP2B_HUMAN
Type:
PROTEIN
Mol. Mass.:
183284.13
Organism:
Homo sapiens (Human)
Description:
ChEMBL_51583
Residue:
1626
  
Inhibitor
Name:
BDBM50127140
Synonyms:
(-)-etoposide 4'-Demethylepipodophyllotoxin 9-(4,6-O-(R)-ethylidene-beta-D-glucopyranoside) 9-((4,6-O-Ethylidine-beta-D-glucopyranosyl)oxy)-5,8,8a,9-tetrahydro-5-(4-hydroxy-3,4-dimethyloxyphenyl)furo(3',4'':6,7)naptho-(2,3-d)-1,3-dioxol-6(5aH)-one Etoposide (ET) VP-16 | etoposide
Type:
Small organic molecule
Emp. Form.:
C29H32O13
Mol. Mass.:
588.5566
SMILES:
COc1cc(cc(OC)c1O)[C@H]1[C@@H]2[C@H](COC2=O)[C@H](O[C@@H]2O[C@@H]3CO[C@@H](C)O[C@H]3[C@H](O)[C@H]2O)c2cc3OCOc3cc12
: