Target
5-hydroxytryptamine receptor 3A
Ligand
BDBM50214492
Substrate
Meas. Tech.
ChEMBL_3476 (CHEMBL619054)
Ki
0.537032±n/a nM
Citation
  TBA Bioorg Med Chem Lett 6:477-480 (1996)   
Target
Name:
5-hydroxytryptamine receptor 3A
Synonyms:
5-HT-3 5-HT3A 5-hydroxytryptamine receptor 3 (5-HT3) 5-hydroxytryptamine receptor 3A (5HT3A) 5HT3R HTR3A Serotonin 3 receptor (5HT3) Serotonin-gated ion channel receptor | Serotonin-gated ion channel receptor 3
Type:
Protein
Mol. Mass.:
55283.27
Organism:
Homo sapiens (Human)
Description:
P46098
Residue:
478
  
Inhibitor
Name:
BDBM50214492
Synonyms:
CHEMBL145725 | RS-16566
Type:
Small organic molecule
Emp. Form.:
C18H23ClN4O
Mol. Mass.:
346.854
SMILES:
CC(C)n1cnc2c(cc(Cl)cc12)C(=O)N[C@H]1CN2CCC1CC2
: