Target
Chitotriosidase-1
Ligand
BDBM50214358
Substrate
Meas. Tech.
ChEBML_49251
IC50
16.1±n/a nM
Citation
 Sakuda, SSakurada, M Preparation of biotinylated allosamidins with strong chitinase inhibitory activities. Bioorg Med Chem Lett 8:2987-90 (1998)  
Target
Name:
Chitotriosidase-1
Synonyms:
CHIT1 Chitinase 1 Chitotriosidase Chitotriosidase-1 (CHIT1)
Type:
Enzyme
Mol. Mass.:
51682.25
Organism:
Homo sapiens (Human)
Description:
Q13231
Residue:
466
  
Inhibitor
Name:
BDBM50214358
Synonyms:
CHEMBL318258
Type:
Small organic molecule
Emp. Form.:
C25H42N4O14
Mol. Mass.:
622.6194
SMILES:
CN(C)C1=NC2C(O)C(OC3OC(CO)C(OC4OC(CO)C(O)C(O)C4NC(C)=O)C(O)C3NC(C)=O)C(CO)C2O1
: