Target
5-hydroxytryptamine receptor 2C
Ligand
BDBM50410477
Substrate
Meas. Tech.
ChEMBL_2761 (CHEMBL617758)
Ki
0.501187±n/a nM
Citation
 Bromidge, SMDavies, SDuckworth, DMForbes, ITJones, GEJones, JKing, FDBlackburn, TPHolland, VKennett, GALightowler, SMiddlemiss, DNRiley, GJTrail, BWood, MD 1-[2-[(Heteroarylmethoxy)aryl]carbamoyl]indolines are selective and orally active 5-HT2C receptor inverse agonists. Bioorg Med Chem Lett 10:1867-70 (2000)  
Target
Name:
5-hydroxytryptamine receptor 2C
Synonyms:
5-HT-2C 5-HT2C-INI 5-HTR2C 5-hydroxytryptamine receptor 2C (5-HT-2C) 5HT-1C HTR1C Serotonin (5-HT3) receptor Serotonin Receptor 2C
Type:
G Protein-Coupled Receptor (GPCR)
Mol. Mass.:
51836.79
Organism:
Homo sapiens (Human)
Description:
P28335
Residue:
458
  
Inhibitor
Name:
BDBM50410477
Synonyms:
CHEMBL54719
Type:
Small organic molecule
Emp. Form.:
C22H19F3N4O2
Mol. Mass.:
428.4071
SMILES:
Cc1cc2CCN(C(=O)Nc3ccc(OCc4ccccn4)nc3)c2cc1C(F)(F)F
: