Target
5-hydroxytryptamine receptor 2C
Ligand
BDBM50218198
Substrate
Meas. Tech.
ChEMBL_2761 (CHEMBL617758)
Ki
0.398107±n/a nM
Citation
 Bromidge, SMDavies, SDuckworth, DMForbes, ITJones, GEJones, JKing, FDBlackburn, TPHolland, VKennett, GALightowler, SMiddlemiss, DNRiley, GJTrail, BWood, MD 1-[2-[(Heteroarylmethoxy)aryl]carbamoyl]indolines are selective and orally active 5-HT2C receptor inverse agonists. Bioorg Med Chem Lett 10:1867-70 (2000)  
Target
Name:
5-hydroxytryptamine receptor 2C
Synonyms:
5-HT-2C 5-HT2C-INI 5-HTR2C 5-hydroxytryptamine receptor 2C (5-HT-2C) 5HT-1C HTR1C Serotonin (5-HT3) receptor Serotonin Receptor 2C
Type:
G Protein-Coupled Receptor (GPCR)
Mol. Mass.:
51836.79
Organism:
Homo sapiens (Human)
Description:
P28335
Residue:
458
  
Inhibitor
Name:
BDBM50218198
Synonyms:
CHEMBL55914
Type:
Small organic molecule
Emp. Form.:
C23H21F3N4O2
Mol. Mass.:
442.4336
SMILES:
Cc1cc(NC(=O)N2CCc3cc(C)c(cc23)C(F)(F)F)cnc1OCc1ccccn1
: