Target
Sporulation kinase A
Ligand
BDBM50218646
Substrate
Meas. Tech.
ChEMBL_92581 (CHEMBL700426)
IC50
49000±n/a nM
Citation
 Weidner-Wells, MAOhemeng, KANguyen, VNFraga-Spano, SMacielag, MJWerblood, HMFoleno, BDWebb, GCBarrett, JFHlasta, DJ Amidino benzimidazole inhibitors of bacterial two-component systems. Bioorg Med Chem Lett 11:1545-8 (2001)  
Target
Name:
Sporulation kinase A
Synonyms:
KINA_BACSU Stage II sporulation protein F gsiC scoD spoIIJ
Type:
PROTEIN
Mol. Mass.:
69161.05
Organism:
Bacillus subtilis (strain 168)
Description:
ChEMBL_105028
Residue:
606
  
Inhibitor
Name:
BDBM50218646
Synonyms:
CHEMBL290549
Type:
Small organic molecule
Emp. Form.:
C20H15N3O2
Mol. Mass.:
329.352
SMILES:
NC(=N)c1ccc2nc(oc2c1)-c1ccc(Oc2ccccc2)cc1
: