Target
5-hydroxytryptamine receptor 6
Ligand
BDBM50219087
Substrate
Meas. Tech.
ChEMBL_3633 (CHEMBL619951)
Ki
0.501187±n/a nM
Citation
 Bromidge, SMGriffith, KHeightman, TDJennings, AKing, FDMoss, SFNewman, HRiley, GRoutledge, CSerafinowska, HTThomas, DR Novel (4-piperazin-1-ylquinolin-6-yl) arylsulfonamides with high affinity and selectivity for the 5-HT(6) receptor. Bioorg Med Chem Lett 11:2843-6 (2001)  
Target
Name:
5-hydroxytryptamine receptor 6
Synonyms:
5-HT-6 5-hydroxytryptamine receptor 6 (5-HT-6) 5-hydroxytryptamine receptor 6 (5HT6) HTR6 Serotonin 6 (5-HT6) receptor | Serotonin Receptor 6
Type:
G Protein-Coupled Receptor (GPCR)
Mol. Mass.:
46968.43
Organism:
Homo sapiens (Human)
Description:
P50406
Residue:
440
  
Inhibitor
Name:
BDBM50219087
Synonyms:
CHEMBL97637
Type:
Small organic molecule
Emp. Form.:
C25H24N4O2S
Mol. Mass.:
444.549
SMILES:
O=S(=O)(Nc1ccc2nccc(N3CCNCC3)c2c1)c1ccc(cc1)-c1ccccc1
: