Target
Alcohol dehydrogenase S chain
Ligand
BDBM50226192
Substrate
Meas. Tech.
ChEMBL_30984 (CHEMBL645176)
Ki
707946±n/a nM
Citation
 Hansch, CKlein, TMcClarin, JLangridge, RCornell, NW A quantitative structure-activity relationship and molecular graphics analysis of hydrophobic effects in the interactions of inhibitors with alcohol dehydrogenase. J Med Chem 29:615-20 (1986)  
Target
Name:
Alcohol dehydrogenase S chain
Synonyms:
1.1.1.1 Alcohol dehydrogenase S chain
Type:
PROTEIN
Mol. Mass.:
39633.49
Organism:
Equus caballus
Description:
ChEMBL_105061
Residue:
374
  
Inhibitor
Name:
BDBM50226192
Synonyms:
CHEMBL53752
Type:
Small organic molecule
Emp. Form.:
C5H9NO
Mol. Mass.:
99.1311
SMILES:
C\C=C(/C)C(N)=O
: