Target
cAMP-specific 3',5'-cyclic phosphodiesterase 4A/4B/4C/4D
Ligand
BDBM50227218
Substrate
Meas. Tech.
ChEMBL_217188 (CHEMBL821512)
IC50
35±n/a nM
Citation
 Venuti, MCAlvarez, RBruno, JJStrosberg, AMGu, LChiang, HSMassey, IJChu, NFried, JH Inhibitors of cyclic AMP phosphodiesterase. 4. Synthesis and evaluation of potential prodrugs of lixazinone (N-cyclohexyl-N-methyl-4-[(1,2,3,5-tetrahydro-2- oxoimidazo[2,1-b]quinazolin-7-yl)-oxy]butyramide, RS-82856). J Med Chem 31:2145-52 (1988)  
Target
Name:
cAMP-specific 3',5'-cyclic phosphodiesterase 4A/4B/4C/4D
Synonyms:
Phosphodiesterase 4
Type:
Mol. Mass.:
Description:
ASSAY_ID of ChEMBL is 788178
Components:
This complex has 4 components.
Component 1
Name:
cAMP-specific 3',5'-cyclic phosphodiesterase 4A
Synonyms:
3',5'-cyclic phosphodiesterase PDE46 PDE4A_HUMAN Phosphodiesterase 4A | Phosphodiesterase 4A (PDE4)
Type:
Enzyme
Mol. Mass.:
98113.27
Organism:
Homo sapiens (Human)
Description:
P27815
Residue:
886
  
Component 2
Name:
cAMP-specific 3',5'-cyclic phosphodiesterase 4D
Synonyms:
3',5'-cyclic phosphodiesterase PDE43 PDE4D_HUMAN | Phosphodiesterase 4D
Type:
Protein
Mol. Mass.:
91092.69
Organism:
Homo sapiens (Human)
Description:
Q08499
Residue:
809
  
Component 3
Name:
cAMP-specific 3',5'-cyclic phosphodiesterase 4B
Synonyms:
3',5'-cyclic phosphodiesterase Isoform PDE4B1 PDE4B PDE4B_HUMAN Phosphodiesterase 4B (PDE4B) Phosphodiesterase Type 4 (PDE4B)
Type:
Protein
Mol. Mass.:
83318.87
Organism:
Homo sapiens (Human)
Description:
Q07343
Residue:
736
  
Component 4
Name:
cAMP-specific 3',5'-cyclic phosphodiesterase 4C
Synonyms:
3',5'-cyclic phosphodiesterase NP_000914.2 PDE4C | PDE4C1
Type:
Enzyme Catalytic Domain
Mol. Mass.:
79875.54
Organism:
Homo sapiens (Human)
Description:
Q08493
Residue:
712
  
Inhibitor
Name:
BDBM50227218
Synonyms:
CHEMBL305411
Type:
Small organic molecule
Emp. Form.:
C26H41BrN4O4
Mol. Mass.:
553.532
SMILES:
Br.CN(C1CCCCC1)C(=O)CCCOc1ccc2N=C(N)N(CC(=O)OCC(C)(C)C)Cc2c1
: