Target
Cannabinoid receptor 1/2
Ligand
BDBM60994
Substrate
Meas. Tech.
ChEMBL_46287 (CHEMBL657995)
Ki
46±n/a nM
Citation
 Devane, WABreuer, ASheskin, TJärbe, TUEisen, MSMechoulam, R A novel probe for the cannabinoid receptor. J Med Chem 35:2065-9 (1992)  
Target
Name:
Cannabinoid receptor 1/2
Synonyms:
Cannabinoid receptor
Type:
Mol. Mass.:
Description:
ASSAY_ID of ChEMBL is 1859866
Components:
This complex has 2 components.
Component 1
Name:
Cannabinoid receptor 2
Synonyms:
CANNABINOID CB2 CB2 Cannabinoid CB2 receptor Cnr2 | rCB2
Type:
Enzyme
Mol. Mass.:
39366.68
Organism:
Rattus norvegicus (Rat)
Description:
Q9QZN9
Residue:
360
  
Component 2
Name:
Cannabinoid receptor 1
Synonyms:
Brain-type cannabinoid receptor CB-R CNR1_RAT Cannabinoid receptor Cnr1 | Skr6
Type:
G Protein-Coupled Receptor (GPCR)
Mol. Mass.:
52856.55
Organism:
Rattus norvegicus (rat)
Description:
P20272
Residue:
473
  
Inhibitor
Name:
BDBM60994
Synonyms:
(10R,10aR)-6,6,9-Trimethyl-3-pentyl-6a,7,8,10a-tetrahydro-6H-benzo[c]chromen-1-ol 1N-[2-(5-dimethylaminomethyl-2-furylmethylsulfanyl)ethyl]-1N-methyl-2-nitro-(Z)-1-ethene-1,1-diamine 6,6,9-Trimethyl-3-pentyl-6a,7,8,10a-tetrahydro-6H-benzo[c]chromen-1-ol(DeltaE-9-THC) 8,8-Dimethyl-11-methylene-5-pentyl-3,4,8a,9,10,11,12,12a-octahydro-2H,8H-1,7-dioxa-benzo[c]phenanthrene BDBM50007391 DRONABINOL Tetrahydrocannabinol delta-9-THC delta-9-Tetrahydrocannabinol (THC) delta9-tetrahydrocannabinol
Type:
Emp. Form.:
C21H30O2
Mol. Mass.:
314.4617
SMILES:
CCCCCc1cc(O)c2[C@@H]3C=C(C)CC[C@H]3C(C)(C)Oc2c1
: