Target
5-hydroxytryptamine receptor 1D
Ligand
BDBM10755
Substrate
Meas. Tech.
ChEMBL_1984 (CHEMBL617588)
Kd
13±n/a nM
Citation
 King, FDBrown, AMGaster, LMKaumann, AJMedhurst, ADParker, SGParsons, AAPatch, TLRaval, P (+/-) 3-Amino-6-carboxamido-1,2,3,4-tetrahydrocarbazole: a conformationally restricted analogue of 5-carboxamidotryptamine with selectivity for the serotonin 5-HT1D receptor. J Med Chem 36:1918-9 (1993)  
Target
Name:
5-hydroxytryptamine receptor 1D
Synonyms:
5-HT-1D 5-HT1D 5HT1D_HUMAN HTR1DA Serotonin (5-HT) receptor | Serotonin Receptor 1D
Type:
G Protein-Coupled Receptor (GPCR)
Mol. Mass.:
41920.63
Organism:
Homo sapiens (Human)
Description:
Receptor binding assays were performed using human clone stably expressed in CHO cells.
Residue:
377
  
Inhibitor
Name:
BDBM10755
Synonyms:
14C-5-hydroxy tryptamine creatinine disulfate 5-HT 5-hydroxy tryptamine creatinine disulfate Serotonin | [3H]-5-HT
Type:
Small organic molecule
Emp. Form.:
C10H12N2O
Mol. Mass.:
176.2151
SMILES:
NCCc1c[nH]c2ccc(O)cc12
: