Target
5-hydroxytryptamine receptor 2C
Ligand
BDBM21392
Substrate
Meas. Tech.
ChEMBL_1879 (CHEMBL616476)
Kd
631±n/a nM
Citation
 King, FDBrown, AMGaster, LMKaumann, AJMedhurst, ADParker, SGParsons, AAPatch, TLRaval, P (+/-) 3-Amino-6-carboxamido-1,2,3,4-tetrahydrocarbazole: a conformationally restricted analogue of 5-carboxamidotryptamine with selectivity for the serotonin 5-HT1D receptor. J Med Chem 36:1918-9 (1993)  
Target
Name:
5-hydroxytryptamine receptor 2C
Synonyms:
5-HT2C 5-hydroxytryptamine receptor 2C (5HT2c) 5ht1c Htr2c Serotonin receptor 2a and 2c (5HT2A and 5HT2C)
Type:
Enzyme
Mol. Mass.:
51935.10
Organism:
Rattus norvegicus (Rat)
Description:
P08909
Residue:
460
  
Inhibitor
Name:
BDBM21392
Synonyms:
3-(2-aminoethyl)-1H-indole-5-carboxamide 5-CT,DP CHEMBL1256863 [3H]-5-CT [3H]-5-Carboxyamidotryptamine | [3H]-5-carboxamidotryptamine
Type:
Small organic molecule
Emp. Form.:
C11H13N3O
Mol. Mass.:
203.2404
SMILES:
NCCc1c[nH]c2ccc(cc12)C(N)=O
: