Target
17-beta-hydroxysteroid dehydrogenase type 1
Ligand
BDBM50232158
Substrate
Meas. Tech.
ChEMBL_1646098 (CHEMBL3995154)
IC50
1.4±n/a nM
Citation
 Abdelsamie, ASvan Koppen, CJBey, ESalah, MBörger, CSiebenbürger, LLaschke, MWMenger, MDFrotscher, M Treatment of estrogen-dependent diseases: Design, synthesis and profiling of a selective 17ß-HSD1 inhibitor with sub-nanomolar IC Eur J Med Chem 127:944-957 (2017)  
Target
Name:
17-beta-hydroxysteroid dehydrogenase type 1
Synonyms:
17-beta-HSD 1 17-beta-hydroxysteroid dehydrogenase type 1 20-alpha-HSD E17KSR EDH17B1 EDHB17 Estradiol 17-beta-dehydrogenase 1 (17beta-HSD1) Placental 17-beta-hydroxysteroid dehydrogenase | SDR28C1
Type:
Enzyme
Mol. Mass.:
34945.13
Organism:
Homo sapiens (Human)
Description:
P14061
Residue:
328
  
Inhibitor
Name:
BDBM50232158
Synonyms:
CHEMBL4062685
Type:
Small organic molecule
Emp. Form.:
C25H23ClF2N2O4S
Mol. Mass.:
520.976
SMILES:
COc1c(Cl)cc(cc1CN1CCN(CC1)C(C)=O)-c1ccc(s1)C(=O)c1c(F)ccc(O)c1F
: