Target
Beta-1 adrenergic receptor
Ligand
BDBM25746
Substrate
Meas. Tech.
ChEMBL_1648531 (CHEMBL3997587)
Kd
1.1±n/a nM
Citation
 Schmidt, DGunera, JBaker, JGKolb, P Similarity- and Substructure-Based Development of฿ ACS Med Chem Lett 8:481-485 (2017)  
Target
Name:
Beta-1 adrenergic receptor
Synonyms:
ADRB1 ADRB1_HUMAN Beta-1 adrenoceptor | adrenergic Beta1
Type:
G Protein-Coupled Receptor (GPCR)
Mol. Mass.:
51338.40
Organism:
Homo sapiens (Human)
Description:
P08588
Residue:
477
  
Inhibitor
Name:
BDBM25746
Synonyms:
2-hydroxy-5-{2-[(2-hydroxy-3-{4-[1-methyl-4-(trifluoromethyl)-1H-imidazol-2-yl]phenoxy}propyl)amino]ethoxy}benzamide; methanesulfonic acid CGP-20712A | cid_2685
Type:
Small organic molecule
Emp. Form.:
C23H25F3N4O5
Mol. Mass.:
494.4636
SMILES:
Cn1cc(nc1-c1ccc(OCC(O)CNCCOc2ccc(O)c(c2)C(N)=O)cc1)C(F)(F)F
: