Target
Glycogen phosphorylase, muscle form
Ligand
BDBM10849
Substrate
Meas. Tech.
ChEMBL_1649508 (CHEMBL3998642)
IC50
182000±n/a nM
Citation
 Loughlin, WAJenkins, IDKaris, NDHealy, PC Discovery of new nanomolar inhibitors of GPa: Extension of 2-oxo-1,2-dihydropyridinyl-3-yl amide-based GPa inhibitors. Eur J Med Chem 127:341-356 (2017)  
Target
Name:
Glycogen phosphorylase, muscle form
Synonyms:
2.4.1.1 Myophosphorylase Pygm
Type:
PROTEIN
Mol. Mass.:
97281.35
Organism:
Rattus norvegicus
Description:
ChEMBL_117427
Residue:
842
  
Inhibitor
Name:
BDBM10849
Synonyms:
1,3,7-trimethyl-2,3,6,7-tetrahydro-1H-purine-2,6-dione CHEMBL113 caffeine
Type:
Small organic molecule
Emp. Form.:
C8H10N4O2
Mol. Mass.:
194.1906
SMILES:
Cn1cnc2n(C)c(=O)n(C)c(=O)c12
: