Target
Liver carboxylesterase 1
Ligand
BDBM50233200
Substrate
Meas. Tech.
ChEBML_1649827
Ki
4.7±n/a nM
Citation
 Hatfield, MJChen, JFratt, EMChi, LBollinger, JCBinder, RJBowling, JHyatt, JLScarborough, JJeffries, CPotter, PM Selective Inhibitors of Human Liver Carboxylesterase Based on aß-Lapachone Scaffold: Novel Reagents for Reaction Profiling. J Med Chem 60:1568-1579 (2017)  
Target
Name:
Liver carboxylesterase 1
Synonyms:
Acyl coenzyme A:cholesterol acyltransferase CES1 EST1_HUMAN Serine hydrolase (CES1)
Type:
Protein
Mol. Mass.:
62520.83
Organism:
Homo sapiens (Human)
Description:
Residue:
567
  
Inhibitor
Name:
BDBM50233200
Synonyms:
CHEMBL4071772
Type:
Small organic molecule
Emp. Form.:
C16H9IO3
Mol. Mass.:
376.1453
SMILES:
Ic1ccc(OC2=CC(=O)C(=O)c3ccccc23)cc1
: