Target
Cholinesterase
Ligand
BDBM11682
Substrate
Meas. Tech.
ChEMBL_1654044 (CHEMBL4003410)
IC50
>10000±n/a nM
Citation
 Mohamed, TRao, PPN 2,4-Disubstituted quinazolines as amyloid-ß aggregation inhibitors with dual cholinesterase inhibition and antioxidant properties: Development and structure-activity relationship (SAR) studies. Eur J Med Chem 126:823-843 (2017)  
Target
Name:
Cholinesterase
Synonyms:
Acylcholine acylhydrolase Butyrylcholine esterase (BChE) Butyrylcholinesterase (BuChE) CHLE_HUMAN Cholinesterases Pseudocholinesterase
Type:
Homotetramer
Mol. Mass.:
68422.27
Organism:
Homo sapiens (Human)
Description:
P06276
Residue:
602
  
Inhibitor
Name:
BDBM11682
Synonyms:
2,3-dihydroxybutanedioic acid; 3-[(1S)-1-(dimethylamino)ethyl]phenyl N-ethyl-N-methylcarbamate US9586925, Rivastigmine
Type:
Small organic molecule
Emp. Form.:
C14H22N2O2
Mol. Mass.:
250.3367
SMILES:
CCN(C)C(=O)Oc1cccc(c1)[C@H](C)N(C)C
: