Target
Proteasome subunit beta type-5
Ligand
BDBM50234981
Substrate
Meas. Tech.
ChEMBL_1654306 (CHEMBL4003672)
IC50
1.2±n/a nM
Citation
 Zhuang, RGao, LLv, XXi, JSheng, LZhao, YHe, RHu, XShao, YPan, XLiu, SHuang, WZhou, YLi, JZhang, J Exploration of novel piperazine or piperidine constructed non-covalent peptidyl derivatives as proteasome inhibitors. Eur J Med Chem 126:1056-1070 (2017)  
Target
Name:
Proteasome subunit beta type-5
Synonyms:
20S proteasome chymotrypsin-like LMPX PSB5_HUMAN Proteasome Macropain subunit MB1 X
Type:
Protein
Mol. Mass.:
28480.96
Organism:
Homo sapiens (Human)
Description:
Residue:
263
  
Inhibitor
Name:
BDBM50234981
Synonyms:
CHEMBL4078693
Type:
Small organic molecule
Emp. Form.:
C39H48ClFN6O5
Mol. Mass.:
735.287
SMILES:
CC(C)(C)CNC(=O)C[C@H](NC(=O)N1CCC(CC1)NC(=O)c1ccc(F)cc1)C(=O)N[C@@H](CCc1ccccc1)C(=O)NCc1ccccc1Cl
: