Target
Adenosine receptor A2a
Ligand
BDBM50011294
Substrate
Meas. Tech.
ChEMBL_1654441 (CHEMBL4003807)
Ki
0.300000±n/a nM
Citation
 Basu, SBarawkar, DAThorat, SShejul, YDPatel, MNaykodi, MJain, VSalve, YPrasad, VChaudhary, SGhosh, IBhat, GQuraishi, APatil, HAnsari, SMenon, SUnadkat, VThakare, RSeervi, MSMeru, AVDe, SBhamidipati, RKRouduri, SRPalle, VPChug, AMookhtiar, KA Design, Synthesis of Novel, Potent, Selective, Orally Bioavailable Adenosine A J Med Chem 60:681-694 (2017)  
Target
Name:
Adenosine receptor A2a
Synonyms:
A2A adenosine receptor (hA2A) ADENOSINE A2 ADORA2 Adenosine A2A receptor (A2AAR)
Type:
G Protein-Coupled Receptor (GPCR)
Mol. Mass.:
44716.46
Organism:
Homo sapiens (Human)
Description:
P29274
Residue:
412
  
Inhibitor
Name:
BDBM50011294
Synonyms:
A2A Ro-4494351-002 SYN-115 | TOZADENANT
Type:
Small organic molecule
Emp. Form.:
C19H26N4O4S
Mol. Mass.:
406.499
SMILES:
COc1ccc(N2CCOCC2)c2sc(NC(=O)N3CCC(C)(O)CC3)nc12
: