Target
Mitogen-activated protein kinase kinase kinase 7
Ligand
BDBM16673
Substrate
Meas. Tech.
ChEMBL_1654823 (CHEMBL4004189)
Kd
600±n/a nM
Citation
 Miura, TMatsuo, AMuraoka, TIde, MMorikami, KKamikawa, TNishihara, MKashiwagi, H Identification of a selective inhibitor of transforming growth factorß-activated kinase 1 by biosensor-based screening of focused libraries. Bioorg Med Chem Lett 27:1031-1036 (2017)  
Target
Name:
Mitogen-activated protein kinase kinase kinase 7
Synonyms:
M3K7_HUMAN Mitogen-activated protein kinase kinase kinase 7 TAK1/TAB1 Transforming growth factor-beta-activated kinase 1 (TAK1)
Type:
Protein
Mol. Mass.:
67199.89
Organism:
Homo sapiens (Human)
Description:
O43318
Residue:
606
  
Inhibitor
Name:
BDBM16673
Synonyms:
4-[4-({[4-chloro-3-(trifluoromethyl)phenyl]carbamoyl}amino)phenoxy]-N-methylpyridine-2-carboxamide BAY 43-9006 BAY439006 Hit compound, 8 Sorafenib US10183928, Sorafenib US10227329, Compound Sorafenib US10774070, Compound Sorafenib US11279688, Compound Sorafenib US9029401, Sorafenib US9902709, Comparative example 1 cid_216239
Type:
Small organic molecule
Emp. Form.:
C21H16ClF3N4O3
Mol. Mass.:
464.825
SMILES:
CNC(=O)c1cc(Oc2ccc(NC(=O)Nc3ccc(Cl)c(c3)C(F)(F)F)cc2)ccn1
: