Target
Indoleamine 2,3-dioxygenase 1
Ligand
BDBM25469
Substrate
Meas. Tech.
ChEMBL_1658250 (CHEMBL4007862)
IC50
24000±n/a nM
Citation
 Tomek, PPalmer, BDFlanagan, JUSun, CRaven, ELChing, LM Discovery and evaluation of inhibitors to the immunosuppressive enzyme indoleamine 2,3-dioxygenase 1 (IDO1): Probing the active site-inhibitor interactions. Eur J Med Chem 126:983-996 (2017)  
Target
Name:
Indoleamine 2,3-dioxygenase 1
Synonyms:
I23O1_HUMAN IDO-1 INDO Indoleamine 2,3-dioxygenase | Indoleamine-pyrrole 2,3-dioxygenase
Type:
Enzyme
Mol. Mass.:
45330.80
Organism:
Homo sapiens (Human)
Description:
P14902
Residue:
403
  
Inhibitor
Name:
BDBM25469
Synonyms:
2-[(7-nitro-2,1,3-benzoxadiazol-4-yl)sulfanyl]-1-oxidopyridin-1-ium cid_313619
Type:
Small organic molecule
Emp. Form.:
C11H6N4O4S
Mol. Mass.:
290.255
SMILES:
[O-][N+](=O)c1ccc(Sc2cccc[n+]2[O-])c2nonc12
: