Target
cGMP-dependent 3',5'-cyclic phosphodiesterase
Ligand
BDBM50166893
Substrate
Meas. Tech.
ChEMBL_1658935 (CHEMBL4008547)
IC50
2.0±n/a nM
Citation
 Gomez, LMassari, MEVickers, TFreestone, GVernier, WLy, KXu, RMcCarrick, MMarrone, TMetz, MYan, YGYoder, ZWLemus, RBroadbent, NJBarido, RWarren, NSchmelzer, KNeul, DLee, DAndersen, CBSebring, KAertgeerts, KZhou, XTabatabaei, APeters, MBreitenbucher, JG Design and Synthesis of Novel and Selective Phosphodiesterase 2 (PDE2a) Inhibitors for the Treatment of Memory Disorders. J Med Chem 60:2037-2051 (2017)  
Target
Name:
cGMP-dependent 3',5'-cyclic phosphodiesterase
Synonyms:
CGS-PDE Homo sapiens phosphodiesterase 2A (PDE2A) PDE2A cGSPDE
Type:
Enzyme Catalytic Domain
Mol. Mass.:
105691.58
Organism:
Homo sapiens (Human)
Description:
O00408
Residue:
941
  
Inhibitor
Name:
BDBM50166893
Synonyms:
2-(3,4-Dimethoxy-benzyl)-7-[(R)-1-((R)-1-hydroxy-ethyl)-4-phenyl-butyl]-5-methyl-3H-imidazo[5,1-f][1,2,4]triazin-4-one CHEMBL370962 US10543194, Example Bay 60-7550 | US11419874, BAY 60-7550
Type:
Small organic molecule
Emp. Form.:
C27H32N4O4
Mol. Mass.:
476.5674
SMILES:
COc1ccc(Cc2nn3c(nc(C)c3c(=O)[nH]2)[C@@H](CCCc2ccccc2)[C@@H](C)O)cc1OC
: