Target
Bile acid receptor
Ligand
BDBM50236558
Substrate
Meas. Tech.
ChEMBL_1660196 (CHEMBL4009808)
IC50
1.000000±n/a nM
Citation
 Zhang, GLiu, STan, WVerma, RChen, YSun, DHuan, YJiang, QWang, XWang, NXu, YWong, CShen, ZDeng, RLiu, JZhang, YFang, W Synthesis and biological evaluations of chalcones, flavones and chromenes as farnesoid x receptor (FXR) antagonists. Eur J Med Chem 129:303-309 (2017)  
Target
Name:
Bile acid receptor
Synonyms:
BAR FXR HRR1 NR1H4_HUMAN RIP14 Retinoid X receptor-interacting protein 14 | farnesoid x receptor
Type:
Nuclear Receptor
Mol. Mass.:
55916.24
Organism:
Homo sapiens (Human)
Description:
Q96RI1
Residue:
486
  
Inhibitor
Name:
BDBM50236558
Synonyms:
CHEMBL4101903
Type:
Small organic molecule
Emp. Form.:
C34H35FN6O3
Mol. Mass.:
594.6785
SMILES:
CC(C)(C)n1ncc(C(=O)Nc2ccc3cnn(CC4CCN(CC4)c4ccc(cc4)C(O)=O)c3c2)c1-c1ccc(F)cc1
: