Target
Disintegrin and metalloproteinase domain-containing protein 17
Ligand
BDBM50236633
Substrate
Meas. Tech.
ChEMBL_1661177 (CHEMBL4010789)
IC50
0.500000±n/a nM
Citation
 Ouvry, GBerton, YBhurruth-Alcor, YBonnary, LBouix-Peter, CBouquet, KBourotte, MChambon, SComino, CDeprez, BDuvert, DDuvert, GHacini-Rachinel, FHarris, CSLuzy, APMathieu, AMillois, CPascau, JPinto, APolge, GReitz, AReversé, KRosignoli, CTaquet, NHennequin, LF Identification of novel TACE inhibitors compatible with topical application. Bioorg Med Chem Lett 27:1848-1853 (2017)  
Target
Name:
Disintegrin and metalloproteinase domain-containing protein 17
Synonyms:
ADA17_HUMAN CSVP Disintegrin and metalloproteinase domain-containing protein 17 (ADAM17) TNF-alpha convertase TNF-alpha-converting enzyme (TACE) Tumor necrosis factor-α converting enzyme (TACE)
Type:
Enzyme
Mol. Mass.:
93007.89
Organism:
Homo sapiens (Human)
Description:
Residue:
824
  
Inhibitor
Name:
BDBM50236633
Synonyms:
CHEMBL4094122
Type:
Small organic molecule
Emp. Form.:
C28H34N4O7S
Mol. Mass.:
570.657
SMILES:
Cc1cc(COc2ccc(cc2)S(=O)(=O)N[C@@H]2CCN(C[C@@H]2C(=O)NO)C(=O)OC(C)(C)C)c2ccccc2n1
: