Target
Disintegrin and metalloproteinase domain-containing protein 17
Ligand
BDBM50236602
Substrate
Meas. Tech.
ChEMBL_1661177 (CHEMBL4010789)
IC50
0.900000±n/a nM
Citation
 Ouvry, GBerton, YBhurruth-Alcor, YBonnary, LBouix-Peter, CBouquet, KBourotte, MChambon, SComino, CDeprez, BDuvert, DDuvert, GHacini-Rachinel, FHarris, CSLuzy, APMathieu, AMillois, CPascau, JPinto, APolge, GReitz, AReversé, KRosignoli, CTaquet, NHennequin, LF Identification of novel TACE inhibitors compatible with topical application. Bioorg Med Chem Lett 27:1848-1853 (2017)  
Target
Name:
Disintegrin and metalloproteinase domain-containing protein 17
Synonyms:
ADA17_HUMAN CSVP Disintegrin and metalloproteinase domain-containing protein 17 (ADAM17) TNF-alpha convertase TNF-alpha-converting enzyme (TACE) Tumor necrosis factor-α converting enzyme (TACE)
Type:
Enzyme
Mol. Mass.:
93007.89
Organism:
Homo sapiens (Human)
Description:
Residue:
824
  
Inhibitor
Name:
BDBM50236602
Synonyms:
CHEMBL4075636
Type:
Small organic molecule
Emp. Form.:
C25H28N4O6S
Mol. Mass.:
512.578
SMILES:
CC(=O)N1CCC(NS(=O)(=O)c2ccc(OCc3cc(C)nc4ccccc34)cc2)C(C1)C(=O)NO
: