Target
Disintegrin and metalloproteinase domain-containing protein 17
Ligand
BDBM50236615
Substrate
Meas. Tech.
ChEMBL_1661177 (CHEMBL4010789)
IC50
0.600000±n/a nM
Citation
 Ouvry, GBerton, YBhurruth-Alcor, YBonnary, LBouix-Peter, CBouquet, KBourotte, MChambon, SComino, CDeprez, BDuvert, DDuvert, GHacini-Rachinel, FHarris, CSLuzy, APMathieu, AMillois, CPascau, JPinto, APolge, GReitz, AReversé, KRosignoli, CTaquet, NHennequin, LF Identification of novel TACE inhibitors compatible with topical application. Bioorg Med Chem Lett 27:1848-1853 (2017)  
Target
Name:
Disintegrin and metalloproteinase domain-containing protein 17
Synonyms:
ADA17_HUMAN CSVP Disintegrin and metalloproteinase domain-containing protein 17 (ADAM17) TNF-alpha convertase TNF-alpha-converting enzyme (TACE) Tumor necrosis factor-α converting enzyme (TACE)
Type:
Enzyme
Mol. Mass.:
93007.89
Organism:
Homo sapiens (Human)
Description:
Residue:
824
  
Inhibitor
Name:
BDBM50236615
Synonyms:
CHEMBL4076782
Type:
Small organic molecule
Emp. Form.:
C25H29N3O6S
Mol. Mass.:
499.579
SMILES:
CN([C@@H]1CCC[C@]1(CO)C(=O)NO)S(=O)(=O)c1ccc(OCc2cc(C)nc3ccccc23)cc1
: