Target
D(2) dopamine receptor
Ligand
BDBM50237165
Substrate
Meas. Tech.
ChEMBL_1660563 (CHEMBL4010175)
EC50
0.170000±n/a nM
Citation
 Möller, DBanerjee, AUzuneser, TCSkultety, MHuth, TPlouffe, BHübner, HAlzheimer, CFriedland, KMüller, CPBouvier, MGmeiner, P Discovery of G Protein-Biased Dopaminergics with a Pyrazolo[1,5-a]pyridine Substructure. J Med Chem 60:2908-2929 (2017)  
Target
Name:
D(2) dopamine receptor
Synonyms:
D(2) dopamine receptor DOPAMINE D2 Long DRD2 Dopamine D2 receptor Dopamine D2 receptor (D2R) Dopamine2-like | d2
Type:
Cell-surface receptors
Mol. Mass.:
50647.10
Organism:
Homo sapiens (Human)
Description:
P14416
Residue:
443
  
Inhibitor
Name:
BDBM50237165
Synonyms:
CHEMBL4098859
Type:
Small organic molecule
Emp. Form.:
C25H32N4O3
Mol. Mass.:
436.5466
SMILES:
CCCN(CCCCOc1ccn2ncc(\C=N/O)c2c1)[C@H]1CCc2c(O)cccc2C1
: