Target
Aldehyde dehydrogenase, mitochondrial
Ligand
BDBM50236910
Substrate
Meas. Tech.
ChEMBL_1659742 (CHEMBL4009354)
Ki
2400±n/a nM
Citation
 Buchman, CDHurley, TD Inhibition of the Aldehyde Dehydrogenase 1/2 Family by Psoralen and Coumarin Derivatives. J Med Chem 60:2439-2455 (2017)  
Target
Name:
Aldehyde dehydrogenase, mitochondrial
Synonyms:
ALDH class 2 ALDH2 ALDHI Aldehyde dehydrogenase (ALDH2)
Type:
Enzyme
Mol. Mass.:
56382.67
Organism:
Homo sapiens (Human)
Description:
P05091
Residue:
517
  
Inhibitor
Name:
BDBM50236910
Synonyms:
CHEMBL4083412
Type:
Small organic molecule
Emp. Form.:
C11H8BrNO3
Mol. Mass.:
282.09
SMILES:
C\C(=N/O)c1cc2cc(Br)ccc2oc1=O
: