Target
Bile salt export pump
Ligand
BDBM50027886
Substrate
Meas. Tech.
ChEMBL_1661982 (CHEMBL4011663)
IC50
>135000±n/a nM
Citation
 Morgan, RETrauner, Mvan Staden, CJLee, PHRamachandran, BEschenberg, MAfshari, CAQualls, CWLightfoot-Dunn, RHamadeh, HK Interference with bile salt export pump function is a susceptibility factor for human liver injury in drug development. Toxicol Sci 118:485-500 (2010)  
Target
Name:
Bile salt export pump
Synonyms:
ABCB11 ATP-binding cassette sub-family B member 11 Bile Salt Export Pump, BSEP Bile salt export pump (BSEP)
Type:
Protein
Mol. Mass.:
146405.49
Organism:
Homo sapiens (Human)
Description:
O95342
Residue:
1321
  
Inhibitor
Name:
BDBM50027886
Synonyms:
1-Butyl-3-(p-methylphenylsulfonyl)urea 1-Butyl-3-tosylurea N-(4-Methylphenylsulfonyl)-N'-butylurea N-Butyl-N'-(p-tolylsulfonyl)urea N-n-Butyl-N'-tosylurea TOLBUTAMIDE
Type:
Small organic molecule
Emp. Form.:
C12H18N2O3S
Mol. Mass.:
270.348
SMILES:
CCCCNC(=O)NS(=O)(=O)c1ccc(C)cc1
: