Target
Bile salt export pump
Ligand
BDBM71542
Substrate
Meas. Tech.
ChEMBL_1661982 (CHEMBL4011663)
IC50
32700±n/a nM
Citation
 Morgan, RETrauner, Mvan Staden, CJLee, PHRamachandran, BEschenberg, MAfshari, CAQualls, CWLightfoot-Dunn, RHamadeh, HK Interference with bile salt export pump function is a susceptibility factor for human liver injury in drug development. Toxicol Sci 118:485-500 (2010)  
Target
Name:
Bile salt export pump
Synonyms:
ABCB11 ATP-binding cassette sub-family B member 11 Bile Salt Export Pump, BSEP Bile salt export pump (BSEP)
Type:
Protein
Mol. Mass.:
146405.49
Organism:
Homo sapiens (Human)
Description:
O95342
Residue:
1321
  
Inhibitor
Name:
BDBM71542
Synonyms:
(4-amino-1-methyl-butyl)-(6-methoxy-8-quinolyl)amine;phosphoric acid MLS001334045 N4-(6-methoxyquinolin-8-yl)pentane-1,4-diamine;phosphoric acid SMR000875314 | cid_359247
Type:
Small organic molecule
Emp. Form.:
C15H21N3O
Mol. Mass.:
259.3467
SMILES:
COc1cc(NC(C)CCCN)c2ncccc2c1
: