Target
Bile salt export pump
Ligand
BDBM86704
Substrate
Meas. Tech.
ChEMBL_1661991 (CHEMBL4011672)
IC50
36100±n/a nM
Citation
 Aleo, MDLuo, YSwiss, RBonin, PDPotter, DMWill, Y Human drug-induced liver injury severity is highly associated with dual inhibition of liver mitochondrial function and bile salt export pump. Hepatology 60:1015-22 (2014)  
Target
Name:
Bile salt export pump
Synonyms:
ABCB11 ATP-binding cassette sub-family B member 11 Bile Salt Export Pump, BSEP Bile salt export pump (BSEP)
Type:
Protein
Mol. Mass.:
146405.49
Organism:
Homo sapiens (Human)
Description:
O95342
Residue:
1321
  
Inhibitor
Name:
BDBM86704
Synonyms:
CAS_93957-54-1 cid_446155
Type:
Small organic molecule
Emp. Form.:
C24H26FNO4
Mol. Mass.:
411.4659
SMILES:
CC(C)n1c(\C=C\[C@@H](O)C[C@@H](O)CC(O)=O)c(-c2ccc(F)cc2)c2ccccc12
: