Target
A disintegrin and metalloproteinase with thrombospondin motifs 4
Ligand
BDBM194638
Substrate
Meas. Tech.
ChEMBL_1663583 (CHEMBL4013264)
IC50
1.000000±n/a nM
Citation
 Durham, TBMarimuthu, JToth, JLLiu, CAdams, LMudra, DRSwearingen, CLin, CChambers, MGThirunavukkarasu, KWiley, MR A Highly Selective Hydantoin Inhibitor of Aggrecanase-1 and Aggrecanase-2 with a Low Projected Human Dose. J Med Chem 60:5933-5939 (2017)  
Target
Name:
A disintegrin and metalloproteinase with thrombospondin motifs 4
Synonyms:
A disintegrin and metalloproteinase with thrombospondin motifs 4 (ADAMTS-4) ATS4_HUMAN KIAA0688 | Metalloproteinase with thrombospondin motifs 4 (ADAMTS-4)
Type:
Enzyme
Mol. Mass.:
90214.54
Organism:
Homo sapiens (Human)
Description:
O75173
Residue:
837
  
Inhibitor
Name:
BDBM194638
Synonyms:
US9206139, 1
Type:
Small organic molecule
Emp. Form.:
C18H20F3N3O3
Mol. Mass.:
383.3649
SMILES:
C[C@H](Cc1ccc(cc1)C(F)(F)F)C(=O)NC[C@]1(NC(=O)NC1=O)C1CC1
: