Target
5-hydroxytryptamine receptor 3A
Ligand
BDBM50238419
Substrate
Meas. Tech.
ChEMBL_1663233 (CHEMBL4012914)
EC50
25119±n/a nM
Citation
 Thomson, DWWagner, AJBantscheff, MBenson, REDittus, LDuempelfeld, BDrewes, GKrause, JMoore, JTMueller, KPoeckel, DRau, CSalzer, EShewchuk, LHopf, CEmery, JGMuelbaier, M Discovery of a Highly Selective Tankyrase Inhibitor Displaying Growth Inhibition Effects against a Diverse Range of Tumor Derived Cell Lines. J Med Chem 60:5455-5471 (2017)  
Target
Name:
5-hydroxytryptamine receptor 3A
Synonyms:
5-HT-3 5-HT3A 5-hydroxytryptamine receptor 3 (5-HT3) 5-hydroxytryptamine receptor 3A (5HT3A) 5HT3R HTR3A Serotonin 3 receptor (5HT3) Serotonin-gated ion channel receptor | Serotonin-gated ion channel receptor 3
Type:
Protein
Mol. Mass.:
55283.27
Organism:
Homo sapiens (Human)
Description:
P46098
Residue:
478
  
Inhibitor
Name:
BDBM50238419
Synonyms:
CHEMBL4060134
Type:
Small organic molecule
Emp. Form.:
C24H22N10O2
Mol. Mass.:
482.4973
SMILES:
Cn1cnc(c1)C(=O)N1CCN(CC1)C(=O)c1ccc(Nc2nc3ccccc3n3nnnc23)cc1
: