Target
Estrogen receptor
Ligand
BDBM50238717
Substrate
Meas. Tech.
ChEBML_1664056
Ki
0.380000±n/a nM
Citation
 Min, JGuillen, VSSharma, AZhao, YZiegler, YGong, PMayne, CGSrinivasan, SKim, SHCarlson, KENettles, KWKatzenellenbogen, BSKatzenellenbogen, JA Adamantyl Antiestrogens with Novel Side Chains Reveal a Spectrum of Activities in Suppressing Estrogen Receptor Mediated Activities in Breast Cancer Cells. J Med Chem 60:6321-6336 (2017)  
Target
Name:
Estrogen receptor
Synonyms:
ER ESR ESR1_HUMAN Estrogen receptor Estrogen receptor (ER-alpha) Estrogen receptor alpha (ER) Nuclear receptor subfamily 3 group A member 1
Type:
Protein
Mol. Mass.:
66230.44
Organism:
Homo sapiens (Human)
Description:
P03372
Residue:
595
  
Inhibitor
Name:
BDBM50238717
Synonyms:
CHEMBL4097562
Type:
Small organic molecule
Emp. Form.:
C28H33NO3S
Mol. Mass.:
463.632
SMILES:
CCCNS(=O)(=O)\C=C\c1ccc(cc1)C(=C1C2CC3CC(C2)CC1C3)c1ccc(O)cc1
: