Target
Myeloperoxidase
Ligand
BDBM50332589
Substrate
Meas. Tech.
ChEBML_1664234
IC50
8.0±n/a nM
Citation
 Soubhye, JChikh Alard, IAldib, IPrévost, MGelbcke, MDe Carvalho, AFurtmüller, PGObinger, CFlemmig, JTadrent, SMeyer, FRousseau, ANève, JMathieu, VZouaoui Boudjeltia, KDufrasne, FVan Antwerpen, P Discovery of Novel Potent Reversible and Irreversible Myeloperoxidase Inhibitors Using Virtual Screening Procedure. J Med Chem 60:6563-6586 (2017)  
Target
Name:
Myeloperoxidase
Synonyms:
84 kDa myeloperoxidase MPO Myeloperoxidase Myeloperoxidase heavy chain PERM_HUMAN
Type:
Enzyme
Mol. Mass.:
83888.32
Organism:
Homo sapiens (Human)
Description:
P05164
Residue:
745
  
Inhibitor
Name:
BDBM50332589
Synonyms:
4-(5-fluoro-1H-indol-3-yl)butan-1-amine | CHEMBL1630741
Type:
Small organic molecule
Emp. Form.:
C12H15FN2
Mol. Mass.:
206.2593
SMILES:
NCCCCc1c[nH]c2ccc(F)cc12
: