Target
5-hydroxytryptamine receptor 5B
Ligand
BDBM50007406
Substrate
Ki
3981.07±n/a nM
Comments
PDSP_1808
Citation
 Matthes, HBoschert, UAmlaiky, NGrailhe, RPlassat, JLMuscatelli, FMattei, MGHen, R Mouse 5-hydroxytryptamine5A and 5-hydroxytryptamine5B receptors define a new family of serotonin receptors: cloning, functional expression, and chromosomal localization. Mol Pharmacol 43:313-9 (1993) Target
Name:
5-hydroxytryptamine receptor 5B
Synonyms:
5-HT5B 5HT5B_MOUSE Htr5b
Type:
Enzyme Catalytic Domain
Mol. Mass.:
41221.13
Organism:
MOUSE
Description:
5-HT5B 0 MOUSE::P31387
Residue:
370
  
Inhibitor
Name:
BDBM50007406
Synonyms:
1-(3-(trifluoromethyl)phenyl)piperazine 1-(3-Trifluoromethyl-phenyl)-piperazine(TFMPP) TFMPP
Type:
Small organic molecule
Emp. Form.:
C11H13F3N2
Mol. Mass.:
230.2295
SMILES:
FC(F)(F)c1cccc(c1)N1CCNCC1
: