Target
Alpha-mannosidase 2
Ligand
BDBM84872
Substrate
Meas. Tech.
Inhibition Assay
pH
5.75±0
Temperature
298.15±0 K
IC50
250±0.0 nM
Citation
 Kuntz, DANakayama, SShea, KHori, HUto, YNagasawa, HRose, DR Structural investigation of the binding of 5-substituted swainsonine analogues to Golgi alpha-mannosidase II. Chembiochem 11:673-80 (2010)  
Target
Name:
Alpha-mannosidase 2
Synonyms:
Alpha-mannosidase 2 Golgi alpha-mannosidase II alpha-Man-IIa
Type:
Protein
Mol. Mass.:
126735.79
Organism:
Drosophila melanogaster (Fruit fly)
Description:
Q24451
Residue:
1108
  
Inhibitor
Name:
BDBM84872
Synonyms:
Swainsonine derivative, 7
Type:
Small organic molecule
Emp. Form.:
C20H31NO3
Mol. Mass.:
333.465
SMILES:
CC(C)(C)c1ccc(CC[C@@H]2CC[C@@H](O)C3[C@H](O)[C@H](O)CN23)cc1
: