Target
5-hydroxytryptamine receptor 2C
Ligand
BDBM84994
Substrate
Ki
0.2±n/a nM
Comments
PDSP_1422
Citation
 Bymaster, FPCalligaro, DOFalcone, JFMarsh, RDMoore, NATye, NCSeeman, PWong, DT Radioreceptor binding profile of the atypical antipsychotic olanzapine. Neuropsychopharmacology 14:87-96 (1996)  
Target
Name:
5-hydroxytryptamine receptor 2C
Synonyms:
5-HT-2C 5-HT2C-INI 5-HTR2C 5-hydroxytryptamine receptor 2C (5-HT-2C) 5HT-1C HTR1C Serotonin (5-HT3) receptor Serotonin Receptor 2C
Type:
G Protein-Coupled Receptor (GPCR)
Mol. Mass.:
51836.79
Organism:
Homo sapiens (Human)
Description:
P28335
Residue:
458
  
Inhibitor
Name:
BDBM84994
Synonyms:
CAS_163091 ORG-5222
Type:
Small organic molecule
Emp. Form.:
C17H16ClNO
Mol. Mass.:
285.768
SMILES:
CN1CC2C(C1)c1cc(Cl)ccc1Oc1ccccc21
: