Target
Voltage-dependent L-type calcium channel subunit alpha-1C
Ligand
BDBM50001786
Substrate
Ki
3700±n/a nM
Comments
PDSP_1709
Citation
 Schotte, AJanssen, PFGommeren, WLuyten, WHVan Gompel, PLesage, ASDe Loore, KLeysen, JE Risperidone compared with new and reference antipsychotic drugs: in vitro and in vivo receptor binding. Psychopharmacology (Berl) 124:57-73 (1996)  
Target
Name:
Voltage-dependent L-type calcium channel subunit alpha-1C
Synonyms:
CAC1C_RAT Cacn2 Cacnl1a1 Calcium channel (Type L) Calcium channel, L type, alpha-1 polypeptide, isoform 1, cardiac muscle RBC Voltage-dependent L-type calcium channel subunit alpha-1C Voltage-gated L-type calcium channel alpha-1C subunit | Voltage-gated calcium channel subunit alpha Cav1.2
Type:
Enzyme Catalytic Domain
Mol. Mass.:
243492.26
Organism:
RAT
Description:
Calcium channel 0 RAT::P22002
Residue:
2169
  
Inhibitor
Name:
BDBM50001786
Synonyms:
1-(2-{4-[5-chloro-1-(4-fluorophenyl)-1H-indol-3-yl]piperidin-1-yl}ethyl)imidazolidin-2-one CHEMBL12713 | Sertindole
Type:
Small organic molecule
Emp. Form.:
C24H26ClFN4O
Mol. Mass.:
440.941
SMILES:
Fc1ccc(cc1)-n1cc(C2CCN(CCN3CCNC3=O)CC2)c2cc(Cl)ccc12
: