Target
Gamma-aminobutyric acid receptor subunit alpha-6
Ligand
BDBM26263
Substrate
Ki
115±n/a nM
Comments
PDSP_1609
Citation
 Gunnersen, DKaufman, CMSkolnick, P Pharmacological properties of recombinant "diazepam-insensitive" GABAA receptors. Neuropharmacology 35:1307-14 (1996)  
Target
Name:
Gamma-aminobutyric acid receptor subunit alpha-6
Synonyms:
GABA A Alpha6Beta3Gamma2 GABA receptor alpha-6 subunit Gabra-6 Gamma-aminobutyric acid receptor subunit alpha-6
Type:
Enzyme Catalytic Domain
Mol. Mass.:
51188.24
Organism:
RAT
Description:
GABA A Alpha6Beta2Gamma2 0 RAT::P30191
Residue:
453
  
Inhibitor
Name:
BDBM26263
Synonyms:
Anexate FLUMAZENIL Romazicon ethyl 12-fluoro-8-methyl-9-oxo-2,4,8-triazatricyclo[8.4.0.0^{2,6}]tetradeca-1(14),3,5,10,12-pentaene-5-carboxylate
Type:
Small organic molecule
Emp. Form.:
C15H14FN3O3
Mol. Mass.:
303.2884
SMILES:
CCOC(=O)c1ncn-2c1CN(C)C(=O)c1cc(F)ccc-21
: