Target
D(2) dopamine receptor
Ligand
BDBM79181
Substrate
Ki
850±n/a nM
Comments
PDSP_1908
Citation
 Seeman, PGuan, HCNobrega, JJiwa, DMarkstein, RBalk, JHPicetti, RBorrelli, EVan Tol, HH Dopamine D2-like sites in schizophrenia, but not in Alzheimer's, Huntington's, or control brains, for [3H]benzquinoline. Synapse 25:137-46 (1997)  
Target
Name:
D(2) dopamine receptor
Synonyms:
DOPAMINE D2 DOPAMINE D2 Short Dopamine D2 receptor Drd2
Type:
G Protein-Coupled Receptor (GPCR)
Mol. Mass.:
50931.60
Organism:
Rattus norvegicus (rat)
Description:
P61169
Residue:
444
  
Inhibitor
Name:
BDBM79181
Synonyms:
10-[3-(4-methyl-1-piperazinyl)propyl]-2-(trifluoromethyl)phenothiazine;hydrochloride 10-[3-(4-methylpiperazino)propyl]-2-(trifluoromethyl)phenothiazine;hydrochloride SMR000059133 TRIFLUOPERAZINE DIHYDROCHLORIDE US11542290, Compound Trifluoperazine cid_5566
Type:
Small organic molecule
Emp. Form.:
C21H24F3N3S
Mol. Mass.:
407.496
SMILES:
CN1CCN(CCCN2c3ccccc3Sc3ccc(cc23)C(F)(F)F)CC1
: