Target
Alkaline phosphatase, tissue-nonspecific isozyme
Ligand
BDBM275067
Substrate
Meas. Tech.
TNAP Inhibition Activity
Temperature
298.15±n/a K
IC50
3.40±n/a nM
Comments
extracted
Citation
 Miyazaki, SYamamoto, YSuzuki, KInui, MIzumi, MSoma, KPinkerton, AShinozaki, T Pyridine compounds US Patent  US9879032 Publication Date 1/30/2018 
Target
Name:
Alkaline phosphatase, tissue-nonspecific isozyme
Synonyms:
ALPL tissue-nonspecific alkaline phosphatase precursor
Type:
PROTEIN
Mol. Mass.:
57306.17
Organism:
Homo sapiens (Human)
Description:
ChEMBL_1448917
Residue:
524
  
Inhibitor
Name:
BDBM275067
Synonyms:
US10221195, Example 9 US9879032, Example 9
Type:
Small organic molecule
Emp. Form.:
C15H14ClN3O5S
Mol. Mass.:
383.807
SMILES:
COc1ccc(Cl)cc1S(=O)(=O)Nc1cnc2OCCNC(=O)c2c1
: