Target
Norepinephrine transporter
Ligand
BDBM112777
Substrate
Ki
0.99±n/a nM
Comments
PDSP_1363
Citation
 Owens, MJMorgan, WNPlott, SJNemeroff, CB Neurotransmitter receptor and transporter binding profile of antidepressants and their metabolites. J Pharmacol Exp Ther 283:1305-22 (1997) Target
Name:
Norepinephrine transporter
Synonyms:
Type:
Enzyme Catalytic Domain
Mol. Mass.:
2082.45
Organism:
RAT
Description:
Norepinephrine transporter 0 RAT::Q9JIA2
Residue:
19
MLLARMKPQVQPELGGADQ
  
Inhibitor
Name:
BDBM112777
Synonyms:
NORTRIPTYLINE | US8629135, SW-02
Type:
Small organic molecule
Emp. Form.:
C19H21N
Mol. Mass.:
263.3767
SMILES:
[#6]-[#7]-[#6]-[#6]\[#6]=[#6]-1/c2ccccc2-[#6]-[#6]-c2ccccc-12
: