Target
Neuronal acetylcholine receptor subunit alpha-4
Ligand
BDBM50004108
Substrate
Ki
6690±n/a nM
Comments
PDSP_1311
Citation
 Stauderman, KAMahaffy, LSAkong, MVeliçelebi, GChavez-Noriega, LECrona, JHJohnson, ECElliott, KJGillespie, AReid, RTAdams, PHarpold, MMCorey-Naeve, J Characterization of human recombinant neuronal nicotinic acetylcholine receptor subunit combinations alpha2beta4, alpha3beta4 and alpha4beta4 stably expressed in HEK293 cells. J Pharmacol Exp Ther 284:777-89 (1998) Target
Name:
Neuronal acetylcholine receptor subunit alpha-4
Synonyms:
ACHA4_HUMAN CHRNA4 protein Neuronal acetylcholine receptor protein alpha-4 subunit Nicotinic acetylcholine receptor alpha4/beta2/alpha5
Type:
Mol. Mass.:
69963.49
Organism:
Homo sapiens (Human)
Description:
NACHRA4
Residue:
627
  
Inhibitor
Name:
BDBM50004108
Synonyms:
(+-)-nicotine (RS)-nicotine CHEMBL440464 Nicotine-(+) US11667638, Example Nicotine US9284322, Nicotine nicotine
Type:
Small organic molecule
Emp. Form.:
C10H14N2
Mol. Mass.:
162.2316
SMILES:
CN1CCCC1c1cccnc1
: