Target
Glutamate receptor 3
Ligand
BDBM50002369
Substrate
Ki
2630±n/a nM
Comments
PDSP_1011
Citation
 Varney, MARao, SPJachec, CDeal, CHess, SDDaggett, LPLin, FJohnson, ECVeliçelebi, G Pharmacological characterization of the human ionotropic glutamate receptor subtype GluR3 stably expressed in mammalian cells. J Pharmacol Exp Ther 285:358-70 (1998) Target
Name:
Glutamate receptor 3
Synonyms:
AMPA-selective glutamate receptor 3 GLURC GRIA3_HUMAN GluR-C Glutamate receptor 3 Glutamate receptor ionotropic, AMPA 3
Type:
PROTEIN
Mol. Mass.:
101172.14
Organism:
Homo sapiens (Human)
Description:
ChEMBL_468627
Residue:
894
  
Inhibitor
Name:
BDBM50002369
Synonyms:
(2S-(2alpha,3beta,4beta))-2-carboxy-4-(1-methylethenyl)-3-pyrrolidineacetic acid CHEMBL275040 Digensaeure Kainate L-alpha-kainic acid digenic acid | kainic acid
Type:
Small organic molecule
Emp. Form.:
C10H15NO4
Mol. Mass.:
213.2304
SMILES:
CC(=C)[C@H]1CN[C@@H]([C@H]1CC(O)=O)C(O)=O
: