Target
Sodium-dependent serotonin transporter
Ligand
BDBM82437
Substrate
Ki
70±n/a nM
Comments
PDSP_1088
Citation
 Tatsumi, MGroshan, KBlakely, RDRichelson, E Pharmacological profile of antidepressants and related compounds at human monoamine transporters. Eur J Pharmacol 340:249-58 (1997)  
Target
Name:
Sodium-dependent serotonin transporter
Synonyms:
5-HT Transporter 5HTT SC6A4_HUMAN SLC6A4 Serotonin transporter (5HTT) Sodium-dependent serotonin transporter (SERT) | Solute carrier family 6 member 4
Type:
Multi-pass membrane protein
Mol. Mass.:
70322.51
Organism:
Homo sapiens (Human)
Description:
P31645
Residue:
630
  
Inhibitor
Name:
BDBM82437
Synonyms:
CAS_23047-25-8 NSC_3947 | US8629135, SW-06
Type:
Small organic molecule
Emp. Form.:
C26H27ClN2O
Mol. Mass.:
418.958
SMILES:
CN(CCCN1c2ccccc2CCc2ccccc12)CC(=O)c1ccc(Cl)cc1
: