Target
D(2) dopamine receptor
Ligand
BDBM50008782
Substrate
Ki
0.01±n/a nM
Comments
PDSP_789
Citation
 Seeman, PTallerico, T Antipsychotic drugs which elicit little or no parkinsonism bind more loosely than dopamine to brain D2 receptors, yet occupy high levels of these receptors. Mol Psychiatry 3:123-34 (1998)  
Target
Name:
D(2) dopamine receptor
Synonyms:
D(2) dopamine receptor DOPAMINE D2 Long DRD2 Dopamine D2 receptor Dopamine D2 receptor (D2R) Dopamine2-like | d2
Type:
Cell-surface receptors
Mol. Mass.:
50647.10
Organism:
Homo sapiens (Human)
Description:
P14416
Residue:
443
  
Inhibitor
Name:
BDBM50008782
Synonyms:
CHEMBL44237 Epidepride;N-(1-Ethyl-pyrrolidin-2-ylmethyl)-5-iodo-2,3-dimethoxy-benzamide | N-(1-Ethyl-pyrrolidin-2-ylmethyl)-5-iodo-2,3-dimethoxy-benzamide (epidepride)
Type:
Small organic molecule
Emp. Form.:
C16H23IN2O3
Mol. Mass.:
418.2699
SMILES:
CCN1CCC[C@H]1CNC(=O)c1cc(I)cc(OC)c1OC
: