Target
Neuronal acetylcholine receptor subunit alpha-4
Ligand
BDBM50060582
Substrate
Ki
460±n/a nM
Comments
PDSP_632
Citation
 Whiteaker, PSharples, CGWonnacott, S Agonist-induced up-regulation of alpha4beta2 nicotinic acetylcholine receptors in M10 cells: pharmacological and spatial definition. Mol Pharmacol 53:950-62 (1998) Target
Name:
Neuronal acetylcholine receptor subunit alpha-4
Synonyms:
ACHA4_HUMAN CHRNA4 protein Neuronal acetylcholine receptor protein alpha-4 subunit Nicotinic acetylcholine receptor alpha4/beta2/alpha5
Type:
Mol. Mass.:
69963.49
Organism:
Homo sapiens (Human)
Description:
NACHRA4
Residue:
627
  
Inhibitor
Name:
BDBM50060582
Synonyms:
1,10-Bis(trimethyl ammonium)decane dibromide CHEMBL1134 DECAMETHONIUM BROMIDE N,N,N'',N''-Tetramethyl-decane-1,10-diammonium; dibromide Syncurine | decane-1,10-bis(trimethylammonium bromide)
Type:
Small organic molecule
Emp. Form.:
C16H38N2
Mol. Mass.:
258.4852
SMILES:
C[N+](C)(C)CCCCCCCCCC[N+](C)(C)C
: