Target
Alpha-2A adrenergic receptor
Ligand
BDBM85235
Substrate
Ki
537.03±n/a nM
Comments
PDSP_5983
Citation
 Jasper, JRLesnick, JDChang, LKYamanishi, SSChang, TKHsu, SADaunt, DABonhaus, DWEglen, RM Ligand efficacy and potency at recombinant alpha2 adrenergic receptors: agonist-mediated [35S]GTPgammaS binding. Biochem Pharmacol 55:1035-43 (1998)  
Target
Name:
Alpha-2A adrenergic receptor
Synonyms:
ADRA2A adrenergic Alpha2A
Type:
Enzyme Catalytic Domain
Mol. Mass.:
48888.08
Organism:
MOUSE
Description:
adrenergic Alpha2A ADRA2A MOUSE::Q01338
Residue:
450
  
Inhibitor
Name:
BDBM85235
Synonyms:
CAS_4749-61-5 ST-91
Type:
Small organic molecule
Emp. Form.:
C13H19N3
Mol. Mass.:
217.3101
SMILES:
[#6]-[#6]-c1cccc(-[#6]-[#6])c1\[#7]=[#6]-1\[#7]-[#6]-[#6]-[#7]-1
: